Build Information
Failed to build MultiLogging, reference master (cf06ef
), with Swift 6.1 for Android on 27 May 2025 07:37:40 UTC.
Build Command
bash -c docker run --pull=always --rm -v "checkouts-4606859-2":/host -w "$PWD" registry.gitlab.com/finestructure/spi-images:android-6.1-latest swift build --swift-sdk aarch64-unknown-linux-android24 2>&1
Build Log
========================================
RunAll
========================================
Builder version: 4.63.1
Interrupt handler set up.
========================================
Checkout
========================================
Clone URL: https://github.com/vapor-community/multilogging.git
Reference: master
Initialized empty Git repository in /host/spi-builder-workspace/.git/
hint: Using 'master' as the name for the initial branch. This default branch name
hint: is subject to change. To configure the initial branch name to use in all
hint: of your new repositories, which will suppress this warning, call:
hint:
hint: git config --global init.defaultBranch <name>
hint:
hint: Names commonly chosen instead of 'master' are 'main', 'trunk' and
hint: 'development'. The just-created branch can be renamed via this command:
hint:
hint: git branch -m <name>
From https://github.com/vapor-community/multilogging
* branch master -> FETCH_HEAD
* [new branch] master -> origin/master
HEAD is now at cf06efb Fixes for Swift 4.2
Cloned https://github.com/vapor-community/multilogging.git
Revision (git rev-parse @):
cf06efb8d14ec19b2d591249191d81e8e08ea169
SUCCESS checkout https://github.com/vapor-community/multilogging.git at master
========================================
Build
========================================
Selected platform: android
Swift version: 6.1
Building package at path: $PWD
https://github.com/vapor-community/multilogging.git
https://github.com/vapor-community/multilogging.git
WARNING: environment variable SUPPRESS_SWIFT_6_FLAGS is not set
{
"dependencies" : [
{
"identity" : "vapor",
"requirement" : {
"range" : [
{
"lower_bound" : "3.0.5",
"upper_bound" : "4.0.0"
}
]
},
"type" : "sourceControl",
"url" : "https://github.com/vapor/vapor.git"
}
],
"manifest_display_name" : "MultiLogging",
"name" : "MultiLogging",
"path" : "/host/spi-builder-workspace",
"platforms" : [
],
"products" : [
{
"name" : "MultiLogging",
"targets" : [
"MultiLogging"
],
"type" : {
"library" : [
"automatic"
]
}
},
{
"name" : "LoggingExample",
"targets" : [
"LoggingExample"
],
"type" : {
"executable" : null
}
}
],
"targets" : [
{
"c99name" : "MultiLogging",
"module_type" : "SwiftTarget",
"name" : "MultiLogging",
"path" : "Sources/MultiLogging",
"product_dependencies" : [
"Vapor"
],
"product_memberships" : [
"MultiLogging",
"LoggingExample"
],
"sources" : [
"DiscordLogger.swift",
"FileLogger.swift",
"MultiLogger.swift",
"SlackLogger.swift",
"Utils.swift"
],
"type" : "library"
},
{
"c99name" : "LoggingExample",
"module_type" : "SwiftTarget",
"name" : "LoggingExample",
"path" : "Sources/LoggingExample",
"product_memberships" : [
"LoggingExample"
],
"sources" : [
"main.swift"
],
"target_dependencies" : [
"MultiLogging"
],
"type" : "executable"
}
],
"tools_version" : "4.0"
}
Running build ...
bash -c docker run --pull=always --rm -v "checkouts-4606859-2":/host -w "$PWD" registry.gitlab.com/finestructure/spi-images:android-6.1-latest swift build --swift-sdk aarch64-unknown-linux-android24 -Xswiftc -Xfrontend -Xswiftc -stats-output-dir -Xswiftc -Xfrontend -Xswiftc .stats -Xswiftc -strict-concurrency=complete -Xswiftc -enable-upcoming-feature -Xswiftc StrictConcurrency -Xswiftc -enable-upcoming-feature -Xswiftc DisableOutwardActorInference -Xswiftc -enable-upcoming-feature -Xswiftc GlobalActorIsolatedTypesUsability -Xswiftc -enable-upcoming-feature -Xswiftc InferSendableFromCaptures 2>&1
android-6.1-latest: Pulling from finestructure/spi-images
Digest: sha256:9f3c606dcd2a4f06d17ba472aa533c43685ba7ba19a5c9bc23518a066eb7f86a
Status: Image is up to date for registry.gitlab.com/finestructure/spi-images:android-6.1-latest
Fetching https://github.com/vapor/vapor.git
[1/74378] Fetching vapor
Fetched https://github.com/vapor/vapor.git from cache (2.58s)
Computing version for https://github.com/vapor/vapor.git
Computed https://github.com/vapor/vapor.git at 3.3.3 (3.36s)
Fetching https://github.com/vapor/websocket.git
Fetching https://github.com/vapor/validation.git
Fetching https://github.com/vapor/url-encoded-form.git
Fetching https://github.com/vapor/service.git
Fetching https://github.com/vapor/template-kit.git
Fetching https://github.com/vapor/routing.git
[1/1282] Fetching template-kit
[1283/1663] Fetching template-kit, url-encoded-form
[1664/2242] Fetching template-kit, url-encoded-form, validation
[2243/22969] Fetching template-kit, url-encoded-form, validation, routing
[2244/23888] Fetching template-kit, url-encoded-form, validation, routing, service
[3992/26497] Fetching template-kit, url-encoded-form, validation, routing, service, websocket
Fetched https://github.com/vapor/template-kit.git from cache (0.34s)
[3150/25215] Fetching url-encoded-form, validation, routing, service, websocket
Fetching https://github.com/vapor/multipart.git
Fetched https://github.com/vapor/url-encoded-form.git from cache (0.40s)
[7631/24834] Fetching validation, routing, service, websocket
Fetching https://github.com/vapor/http.git
Fetched https://github.com/vapor/websocket.git from cache (0.53s)
[15800/22225] Fetching validation, routing, service
Fetching https://github.com/vapor/database-kit.git
[17459/25523] Fetching validation, routing, service, multipart
[18756/50990] Fetching validation, routing, service, multipart, http
[20539/52171] Fetching validation, routing, service, multipart, http, database-kit
Fetched https://github.com/vapor/database-kit.git from cache (0.38s)
[33501/50990] Fetching validation, routing, service, multipart, http
Fetching https://github.com/vapor/crypto.git
[43689/53776] Fetching validation, routing, service, multipart, http, crypto
Fetched https://github.com/vapor/service.git from cache (1.53s)
Fetched https://github.com/vapor/crypto.git from cache (0.60s)
[47862/50071] Fetching validation, routing, multipart, http
Fetching https://github.com/vapor/core.git
Fetching https://github.com/vapor/console.git
Fetched https://github.com/vapor/validation.git from cache (1.55s)
Fetched https://github.com/vapor/routing.git from cache (1.59s)
[26587/28765] Fetching multipart, http
[26588/48908] Fetching multipart, http, core
[26991/54485] Fetching multipart, http, core, console
Fetched https://github.com/vapor/http.git from cache (1.69s)
[10674/29018] Fetching multipart, core, console
Fetched https://github.com/vapor/console.git from cache (0.65s)
[15019/23441] Fetching multipart, core
Fetched https://github.com/vapor/multipart.git from cache (2.33s)
Fetched https://github.com/vapor/core.git from cache (1.25s)
Computing version for https://github.com/vapor/http.git
Computed https://github.com/vapor/http.git at 3.4.0 (3.35s)
Fetching https://github.com/apple/swift-nio.git
Fetching https://github.com/apple/swift-nio-ssl.git
[1/14843] Fetching swift-nio-ssl
[1486/90880] Fetching swift-nio-ssl, swift-nio
Fetched https://github.com/apple/swift-nio-ssl.git from cache (3.76s)
Fetched https://github.com/apple/swift-nio.git from cache (3.98s)
Computing version for https://github.com/vapor/validation.git
Computed https://github.com/vapor/validation.git at 2.1.1 (5.41s)
Computing version for https://github.com/vapor/service.git
Computed https://github.com/vapor/service.git at 1.0.2 (0.77s)
Computing version for https://github.com/apple/swift-nio.git
Computed https://github.com/apple/swift-nio.git at 1.14.4 (0.66s)
Fetching https://github.com/apple/swift-nio-zlib-support.git
[1/15] Fetching swift-nio-zlib-support
Fetched https://github.com/apple/swift-nio-zlib-support.git from cache (0.26s)
Computing version for https://github.com/apple/swift-nio-zlib-support.git
Computed https://github.com/apple/swift-nio-zlib-support.git at 1.0.0 (0.82s)
Computing version for https://github.com/vapor/routing.git
Computed https://github.com/vapor/routing.git at 3.1.0 (0.62s)
Computing version for https://github.com/vapor/websocket.git
Computed https://github.com/vapor/websocket.git at 1.1.2 (0.58s)
Computing version for https://github.com/apple/swift-nio-ssl.git
Computed https://github.com/apple/swift-nio-ssl.git at 1.4.0 (0.60s)
Fetching https://github.com/apple/swift-nio-ssl-support.git
[1/16] Fetching swift-nio-ssl-support
Fetched https://github.com/apple/swift-nio-ssl-support.git from cache (0.23s)
Computing version for https://github.com/apple/swift-nio-ssl-support.git
Computed https://github.com/apple/swift-nio-ssl-support.git at 1.0.0 (1.68s)
Computing version for https://github.com/vapor/crypto.git
Computed https://github.com/vapor/crypto.git at 3.4.1 (0.76s)
Computing version for https://github.com/vapor/console.git
Computed https://github.com/vapor/console.git at 3.1.1 (0.59s)
Computing version for https://github.com/vapor/database-kit.git
Computed https://github.com/vapor/database-kit.git at 1.3.3 (0.73s)
Computing version for https://github.com/vapor/url-encoded-form.git
Computed https://github.com/vapor/url-encoded-form.git at 1.1.0 (0.85s)
Computing version for https://github.com/vapor/template-kit.git
Computed https://github.com/vapor/template-kit.git at 1.5.0 (0.95s)
Computing version for https://github.com/vapor/multipart.git
Computed https://github.com/vapor/multipart.git at 3.1.3 (0.64s)
Computing version for https://github.com/vapor/core.git
Computed https://github.com/vapor/core.git at 3.10.1 (0.92s)
Creating working copy for https://github.com/vapor/url-encoded-form.git
Working copy of https://github.com/vapor/url-encoded-form.git resolved at 1.1.0
Creating working copy for https://github.com/vapor/vapor.git
Working copy of https://github.com/vapor/vapor.git resolved at 3.3.3
Creating working copy for https://github.com/vapor/template-kit.git
Working copy of https://github.com/vapor/template-kit.git resolved at 1.5.0
Creating working copy for https://github.com/apple/swift-nio.git
Working copy of https://github.com/apple/swift-nio.git resolved at 1.14.4
Creating working copy for https://github.com/vapor/console.git
Working copy of https://github.com/vapor/console.git resolved at 3.1.1
Creating working copy for https://github.com/vapor/multipart.git
Working copy of https://github.com/vapor/multipart.git resolved at 3.1.3
Creating working copy for https://github.com/vapor/crypto.git
Working copy of https://github.com/vapor/crypto.git resolved at 3.4.1
Creating working copy for https://github.com/vapor/core.git
Working copy of https://github.com/vapor/core.git resolved at 3.10.1
Creating working copy for https://github.com/apple/swift-nio-ssl.git
Working copy of https://github.com/apple/swift-nio-ssl.git resolved at 1.4.0
Creating working copy for https://github.com/apple/swift-nio-ssl-support.git
Working copy of https://github.com/apple/swift-nio-ssl-support.git resolved at 1.0.0
Creating working copy for https://github.com/vapor/routing.git
Working copy of https://github.com/vapor/routing.git resolved at 3.1.0
Creating working copy for https://github.com/vapor/database-kit.git
Working copy of https://github.com/vapor/database-kit.git resolved at 1.3.3
Creating working copy for https://github.com/vapor/http.git
Working copy of https://github.com/vapor/http.git resolved at 3.4.0
Creating working copy for https://github.com/vapor/websocket.git
Working copy of https://github.com/vapor/websocket.git resolved at 1.1.2
Creating working copy for https://github.com/vapor/service.git
Working copy of https://github.com/vapor/service.git resolved at 1.0.2
Creating working copy for https://github.com/apple/swift-nio-zlib-support.git
Working copy of https://github.com/apple/swift-nio-zlib-support.git resolved at 1.0.0
Creating working copy for https://github.com/vapor/validation.git
Working copy of https://github.com/vapor/validation.git resolved at 2.1.1
warning: 'swift-nio-ssl-support': ignoring declared target(s) 'swift-nio-ssl-support' in the system package
warning: 'swift-nio-zlib-support': ignoring declared target(s) 'swift-nio-zlib-support' in the system package
warning: couldn't find pc file for openssl
warning: couldn't find pc file for openssl
Building for debugging...
[0/76] Write sources
In file included from /host/spi-builder-workspace/.build/checkouts/crypto/Sources/CCryptoOpenSSL/shim.c:1:
/host/spi-builder-workspace/.build/checkouts/crypto/Sources/CCryptoOpenSSL/include/c_crypto_openssl.h:4:10: fatal error: 'openssl/conf.h' file not found
4 | #include <openssl/conf.h>
| ^~~~~~~~~~~~~~~~
1 error generated.
[28/76] Compiling CCryptoOpenSSL shim.c
[28/76] Compiling CNIOOpenSSL shims.c
[28/76] Compiling CBase32 base32.c
[28/76] Compiling CBcrypt blf.c
[28/76] Compiling CNIOZlib empty.c
[28/76] Compiling CNIOSHA1 c_nio_sha1.c
[28/76] Compiling CBcrypt bcrypt.c
[28/76] Write swift-version-24593BA9C3E375BF.txt
Running build ...
bash -c docker run --pull=always --rm -v "checkouts-4606859-2":/host -w "$PWD" registry.gitlab.com/finestructure/spi-images:android-6.1-latest swift build --swift-sdk aarch64-unknown-linux-android24 2>&1
android-6.1-latest: Pulling from finestructure/spi-images
Digest: sha256:9f3c606dcd2a4f06d17ba472aa533c43685ba7ba19a5c9bc23518a066eb7f86a
Status: Image is up to date for registry.gitlab.com/finestructure/spi-images:android-6.1-latest
warning: 'swift-nio-ssl-support': ignoring declared target(s) 'swift-nio-ssl-support' in the system package
warning: 'swift-nio-zlib-support': ignoring declared target(s) 'swift-nio-zlib-support' in the system package
warning: couldn't find pc file for openssl
warning: couldn't find pc file for openssl
[0/1] Planning build
Building for debugging...
[0/48] Compiling CNIOZlib empty.c
In file included from /host/spi-builder-workspace/.build/checkouts/swift-nio-ssl/Sources/CNIOOpenSSL/shims.c:16:
/host/spi-builder-workspace/.build/checkouts/swift-nio-ssl/Sources/CNIOOpenSSL/include/c_nio_openssl.h:17:10: fatal error: 'openssl/conf.h' file not found
17 | #include <openssl/conf.h>
| ^~~~~~~~~~~~~~~~
1 error generated.
[1/48] Compiling CNIOOpenSSL shims.c
[1/48] Compiling CNIODarwin shim.c
[1/48] Compiling CNIOLinux shim.c
In file included from /host/spi-builder-workspace/.build/checkouts/swift-nio-ssl/Sources/CNIOOpenSSL/helpers.c:14:
/host/spi-builder-workspace/.build/checkouts/swift-nio-ssl/Sources/CNIOOpenSSL/include/c_nio_openssl.h:17:10: fatal error: 'openssl/conf.h' file not found
17 | #include <openssl/conf.h>
| ^~~~~~~~~~~~~~~~
[1/48] Compiling CNIOOpenSSL helpers.c
[1/48] Compiling CNIOLinux ifaddrs-android.c
[1/48] Compiling CNIOSHA1 c_nio_sha1.c
[1/48] Compiling CNIOHTTPParser c_nio_http_parser.c
[1/48] Write swift-version-24593BA9C3E375BF.txt
BUILD FAILURE 6.1 android